{"text_format":"1","workbook":"xlsx","n_sheets":4,"sheets":["Parámetros","Resultados","InstruccDiligenciamiento","Formato 301 - PP&E Carretero"],"not_rendered":{"charts":0,"images":30,"macros":1,"external_links":0,"defined_names":7,"comments":0,"pivot_tables":1},"unopened":[],"bounds":{"document_bytes":16777216,"sheet_cells":100000,"rows_first":2000,"rows_last":500,"rows_between":2000,"halvings":0,"cell_chars":16384,"cell_head_chars":4096},"cells_cut":0,"cells_raw":0,"read":"whole","date_system":"1900"}

{"sheet":"Parámetros","index":0,"n_rows":47,"n_cols":20,"rows_kept":47,"cut":false,"hidden":true,"merged":[]}
[]
[null,"Tipo","Grupo",null,"Subgrupo",null,"Nombre del Proyecto","Gener.","No. Contrato Concesión","Nombre del Concesionario o Contratista","NIT Concesionario","Fecha inicial del contrato:","Plazo inicial de la concesión (años):",null,"Estados",null,"Adquisicion",null,"Periodicidad"]
[null,"Propiedades, Planta Y Equipo","1.1 Equipos de la(s) Estación(es) de Peaje",null,"Casetas Y Campamentos",null,"Seleccionar",null,null,null,null,null,null,null,"Traslado",null,"Nuevo",null,"Seleccionar","INDIRECTO(\"T_Grupo[Grupo]\")"]
[null,"Propiedades, Planta Y Equipo","1.2 Equipos de la(s) Estación(es) de Pesaje",null,"Equipo De Centros De Control",null,"Accenorte","4G","001-2017","Accesos Norte De Bogotá S.A.S",901039225,"2017-04-07",25,null,"Retirados",null,"Sustitución",null,"Reversión","INDIRECTO(\"Estados[Estados]\")"]
[null,"Propiedades, Planta Y Equipo","1.3 Equipos de centros de atención al  usuario",null,"Equipo De Computación",null,"Accesos Norte Fase II","5G","001-2022","Concesionaria Ruta Bogotá Norte S.A.S.",901580796,"2022-06-23",29,null,null,null,null,null,"Anual","INDIRECTO(\"T_Adquisicion\")"]
[null,"Propiedades, Planta Y Equipo","1.4 Equipos del (los) Centro(s) de Control de Operaciones",null,"Equipo De Comunicación",null,"ALO Sur","5G","003-2021","Alo Sur Sas",901551242,"2022-07-19",30]
[null,"Propiedades, Planta Y Equipo","1.5 Equipos instalados para la Operación del Proyecto",null,"Equipo De Seguridad Y Rescate",null,"Armenia - Pereira - Manizales","1G","113-1997","Autopistas Del Café S.A.",830025490,"1997-06-16",30]
[null,"Propiedades, Planta Y Equipo","1.6 Equipos entregados a la Policía de Carreteras",null,"Equipo De Servicio Ambulatorio",null,"Autopista Concesión Pacifico 1","4G","007-2014","Concesionaria Vial Del Pacifico  S.A.S - Covipacifico S.A.",900744773,"2014-11-11",25]
[null,"Propiedades, Planta Y Equipo","1.7 Elementos de Traslado Asistencial Médico (TAM)",null,"Equipo De Transporte - De Elevación",null,"Autopista Concesión Pacifico 2","4G","006-2014","Concesionaria La Pintada",900740893,"2014-11-11",25]
[null,"Software Y Licencias","2.1 Software",null,"Equipo De Transporte - De Tracción",null,"Autopista Concesión Pacifico 3","4G","005-2014","Concesionario Pacifico 3 S.A.S",900763357,"2014-11-04",25]
[null,"Software Y Licencias","2.2 Licencias",null,"Equipo De Transporte - Terrestre",null,"Autopista Para La Prosperidad Mar 1","4G","014-2015","Desarrollo Vía La Mar Sas",900869678,"2015-10-15",25]
[null,null,null,null,"Equipos De Radares",null,"Autopista Para La Prosperidad Mar 2","4G","018-2015","Autopistas Uraba Sas",900902591,"2016-01-12",25]
[null,null,null,null,"Líneas Y Cables De Telecomunicaciones",null,"Autopistas Al Rio Magdalena 2","4G","008-2014","Autopista Río Magdalena S.A.S Grupo Ohl",900788548,"2015-03-14",25]
[null,null,null,null,"Líneas Y Cables De Transmisión",null,"Autopistas Conexión Norte Remedios Zaragoza Caucasia","4G","009-2014","Concesión Autopistas Del Nordeste S.A.S",900793991,"2015-02-05",25]
[null,null,null,null,"Muebles Y Enseres",null,"Autopistas del Caribe - Ruta Caribe 2","4G","002-2021","Autopistas Del Caribe Sas",901515242,"2021-10-19",35]
[null,null,null,null,"Otra Maquinaria Y Equipo",null,"Bogota - Siberia - Punta el vino -  Villeta","1G","447-1994","Concesión Sabana De Occidente",800235280,"1994-08-24",32]
[null,null,null,null,"Otras Redes, Líneas Y Cables",null,"Briceño-Tunja-Sogamoso","3G","377-2002","Bts Concesionario Sas",901371481,"2002-09-23",30]
[null,null,null,null,"Plantas De Generación",null,"Bucaramanga - Pamplona","4G","002-2016","Autovía Bucaramanga Pamplona Sas",900972713,"2016-07-21",25]
[null,null,null,null,"Satélites Y Antenas",null,"Bucaramanga-Barrancabermeja-Yondó","4G","013-2015","Concesionaria Ruta Del Cacao Sas",900871368,"2015-10-13",25]
[null,null,null,null,"Software - Concesiones",null,"Buga Loboguerrero Buenaventura","5G","004-2022","Union Vial Camino Del Pacifico Sas",830054539,"2023-02-16",29]
[null,null,null,null,"Licencias - Concesiones",null,"IP - Cambao - Manizales ","4G","008-2015","Concesionaria Alternativas Viales Sas",900864150,"2015-08-21",34]
[null,null,null,null,null,null,"Cartagena Barranquilla 4G","4G","004-2014","Concesion Costera Cartagena - Barranquilla",900763355,"2014-11-04",25]
[null,null,null,null,null,null,"Cordoba - Sucre","3G","002-2007","Autopisas De La Sabana",900135168,"2007-11-01",17]
[null,null,null,null,null,null,"Desarrollo Vial Para El Oriente De Medellin Y Valle De Rionegro","1G","275-1996","Devimed S.A.",811005050,"1996-06-16",30]
[null,null,null,null,null,null,"Fontibon Facatativa Los Alpes","1G","937-1995","Concesiones Ccfc",830006021,"1995-09-25",29]
[null,null,null,null,null,null,"Girardot - Honda-Puerto Salgar ","4G","003-2014","Concesión Alto Magdalena",900745219,"2014-11-04",25]
[null,null,null,null,null,null,"IP Antioquia - Bolivar","4G","016-2015","Concesión Ruta Al Mar S.A.S.",900894996,"2015-11-27",34]
[null,null,null,null,null,null,"IP Chirajara Fundadores/ Sociedad Vial Andina S.A.S.","4G","005-2015","Concesionaria Vial Andina S.A.S. Coviandina Sas",900848064,"2015-07-23",39]
[null,null,null,null,null,null,"IP Girardot - Ibague - Cajamarca","4G","002-2015","Gica S.A.",900816750,"2015-04-14",28]
[null,null,null,null,null,null,"IP Malla Vial del Meta","4G","004-2015","Concesión Vial De Los Llanos S.A",900843297,"2015-06-09",30]
[null,null,null,null,null,null,"IP Neiva - Espinal - Girardot","5G","017-2015","Autovia Neiva Girardot Sas",900903279,"2015-12-23",30]
[null,null,null,null,null,null,"IP Tercer Carril","4G","004-2016","Vía 40 Express Sas ",901009478,"2016-12-01",30]
[null,null,null,null,null,null,"IP Vias Del Nus","4G","001-2016","Concesión Vías Del Nus",900920562,"2016-03-09",30]
[null,null,null,null,null,null,"Mulaló – Loboguerrero.","4G","001-2015","Concesionaria Nueva Vía Al Mar S.A.S",900809931,"2015-03-17",25]
[null,null,null,null,null,null,"Nueva Malla Vial Del Valle Del Cauca – Corredor Accesos Cali Y Palmira","4G","001-2021","Concesionarias Ruta Del Valle Sas",901489687,"2021-09-01",19]
[null,null,null,null,null,null,"Pamplona - Cucuta","4G","002-2017","Union Vial Rio Pamplonita Sas",901082545,"2017-07-31",25]
[null,null,null,null,null,null,"Pasto - Rumichaca","4G","015-2015","Concesionaria Vial Unión Del Sur S.A.S.",900880846,"2015-10-27",25]
[null,null,null,null,null,null,"Perimetral De Oriente Cundinamarca","4G","002-2014","Concesión Perimetral Oriental De Bogota Sas",900761657,"2014-12-19",25]
[null,null,null,null,null,null,"Popayan - Santander De Quilichao","4G","011-2015","Nuevo Cauca Sas - Popayan - Santander De Quilichao",900866440,"2015-09-23",25]
[null,null,null,null,null,null,"Puerta de Hierro - Palmar de Varela y Carreto - Cruz del Viso","4G","007-2015","Concesionaria Montes De Maria",900858096,"2015-08-19",25]
{"$rows_left_out":8}
{"sheet":"Resultados","index":1,"n_rows":12,"n_cols":8,"rows_kept":12,"cut":false,"hidden":true,"merged":[]}
[]
[null,"Concepto","Valor Activo ","Deprec. / Amortiz. Acumulada","Valor remanente Activo"]
[]
[]
[]
[null,null,"Etiquetas de columna"]
[null,null,"Valor Activo ",null,"Deprec. / Amortiz. Acumulada",null,"Total Valor Activo ","Total Deprec. / Amortiz. Acumulada"]
[null,"Concepto","3. Posterior","#¡NUM!","3. Posterior","#¡NUM!"]
[null,"Activo",20330000,0,0,0,20330000,0]
[null,0,0,0,0,0,0,0]
[null,"Equipo De Transporte - Terrestre",20330000,0,0,0,20330000,0]
[null,"Total general",20330000,0,0,0,20330000,0]

{"sheet":"InstruccDiligenciamiento","index":2,"n_rows":394,"n_cols":3,"rows_kept":394,"cut":false,"hidden":false,"merged":[[388,2,388,3],[390,2,390,3],[392,2,392,3],[378,2,378,3],[393,2,393,3],[386,2,386,3],[304,2,304,3],[306,2,306,3],[315,2,315,3],[325,2,325,3],[384,2,384,3],[300,2,300,3],[202,2,202,3],[211,2,211,3],[219,2,219,3],[227,2,227,3],[235,2,235,3],[243,2,243,3],[246,2,246,3],[248,2,248,3],[257,2,257,3],[275,2,275,3],[292,2,292,3],[194,2,194,3],[160,2,160,3],[161,2,161,3],[162,2,162,3],[163,2,163,3],[164,2,164,3],[165,2,165,3],[166,2,166,3],[167,2,167,3],[168,2,168,3],[169,2,169,3],[184,2,184,3],[159,2,159,3],[136,2,136,3],[149,2,149,3],[150,2,150,3],[151,2,151,3],[152,2,152,3],[153,2,153,3],[154,2,154,3],[155,2,155,3],[156,2,156,3],[157,2,157,3],[158,2,158,3],[127,2,127,3],[84,2,84,3],[85,2,85,3],[87,2,87,3],[89,2,89,3],[90,2,90,3],[106,2,106,3],[107,2,107,3],[122,2,122,3],[124,2,124,3],[125,2,125,3],[126,2,126,3],[2,2,2,3],[59,2,59,3],[80,2,80,3],[82,2,82,3],[25,2,25,3],[35,2,35,3],[4,2,4,3],[44,2,44,3],[54,2,54,3],[65,2,66,3],[72,2,72,3],[73,2,73,3],[75,2,75,3],[79,2,79,3]]}
[]
[]
[null,null,"INSTRUCCIONES PARA EL DILIGENCIAMIENTO DEL FORMATO\nPROPIEDADES, PLANTA Y EQUIPO EN LOS ACUERDOS DE CONCESIÓN DE INFRAESTRUCTURA DE TRANSPORTE DEL MODO CARRETERO BAJO EL NUEVO MARCO NORMATIVO PARA ENTIDADES DE GOBIERNO"]
[]
[null,null,"Formato PP&E Carretero: Esta hoja contiene el formato “GCSP-F-301 - PROPIEDADES, PLANTA Y EQUIPO EN LOS ACUERDOS DE CONCESIÓN DE INFRAESTRUCTURA DE TRANSPORTE DEL MODO CARRETERO MARCO NORMATIVO PARA ENTIDADES DE GOBIERNO”, información final que será reportada para su registro en los estados financieros de la Agencia."]
[]
[]
[null,null,"DILIGENCIAMIENTO “Formato PP&E Carretero”:"]
[]
[null,null,"Este archivo debe ser descargado de la pagina web de la Agencia en siguiente enlace: "]
[]
[null,null,"https://www.ani.gov.co/sig/documentos-sig?field_tipo_de_documento_tid=All&field_tipo_de_formato_tid=All&field_codigo_value=GCSP-F-301&title="]
[]
[]
[]
[null,null,"Nota:"]
[null,null,"Para abrir el archivo por primera vez una vez descargado del link por favor seguir las siguientes instrucciones"]
[null,null,"buscar en descargas dar click derecho sobre el archivo Excel /propiedades/seguridad"]
[null,null,"dar cclic en desbloquear y luego aplicar"]
[]
[]
[null,null,"1.  DATOS DE IDENTIFICACIÓN DEL PROYECTO"]
[]
[null,null,"Las columnas con fuente de color anaranjado       corresponden a información que debe ser diligenciada por el usuario. "]
[]
[null,null,"Proyecto de Concesión: En este campo, el usuario debe seleccionar de la lista desplegable el proyecto de concesión a reportar."]
[]
[]
[]
[]
[]
[]
[]
[]
[]
[null,null,"No. de Contrato de concesión; NIT del concesionario; Fecha inicial del contrato; plazo inicial de la concesión: Una vez seleccionado el proyecto de concesión, los valores de estos campos se completarán automáticamente, sin necesidad de intervención por parte del usuario."]
[]
[]
[]
[]
{"$rows_left_out":355}
{"sheet":"Formato 301 - PP&E Carretero","index":3,"n_rows":80,"n_cols":19,"rows_kept":80,"cut":false,"hidden":false,"merged":[[2,10,2,11],[2,14,2,17],[12,6,12,10],[11,4,11,5],[12,4,12,5],[11,6,11,14],[12,13,12,14],[0,1,2,4],[0,5,0,17],[1,5,1,17],[2,8,2,9],[2,6,2,7],[4,4,4,12],[7,6,7,14],[8,6,8,14],[14,4,15,17],[17,13,17,14],[9,6,9,14],[10,6,10,14],[6,4,6,5],[6,6,6,12],[7,4,7,5],[8,4,8,5],[9,4,9,5],[10,4,10,5],[12,11,12,12]]}
[null,null,null,null,null,"PROPIEDADES, PLANTA Y EQUIPO EN LOS ACUERDOS DE CONCESIÓN DE INFRAESTRUCTURA DE TRANSPORTE DEL MODO CARRETERO MARCO NORMATIVO PARA ENTIDADES DE GOBIERNO"]
[null,null,null,null,null,"GESTIÓN CONTRACTUAL Y SEGUIMIENTO A PROYECTOS DE INFRAESTRUCTURA DE TRANSPORTE"]
[null,null,null,null,null,"CÓDIGO","GCSP-F-301",null,"VERSIÓN",null,3,null,null,"FECHA","2025-10-16"]
[]
[]
[null,null,null,null,"1. DATOS DE IDENTIFICACIÓN DEL PROYECTO"]
[]
[null,null,null,null,"Proyecto de concesión:",null,"Seleccionar"]
[null,null,null,null,"Contrato de Concesión No: ",null,{"$f":"+VLOOKUP(G8,Parámetros!$G:$M,3,0)","v":0}]
[null,null,null,null,"NIT: ",null,{"$f":"+VLOOKUP(G8,Parámetros!$G:$M,5,0)","v":0}]
[null,null,null,null,"Fecha inicial del contrato:",null,{"$f":"+VLOOKUP(G8,Parámetros!$G:$M,6,0)","v":"00:00:00"}]
[null,null,null,null,"Plazo inicial de la concesión (años):",null,{"$f":"+VLOOKUP(G8,Parámetros!$G:$M,7,0)","v":0}]
[null,null,null,null,"Con corte a: ",null,null,null,null,null,null,"Periodicidad:"]
[]
[null,null,null,null,"Los hechos económicos de las concesiones deben registrarse en la Contabilidad de la Agencia Nacional de Infraestructura - ANI, de acuerdo con los lineamientos señalados en las Resoluciones 602 de 2018 y las normas que la modifiquen, expedidas por la Contaduría General de la Nación; las cuales fueron acogidas mediante el Manual GADF-M-008 \"Manual Contable Bajo El Nuevo Marco Normativo De Contabilidad Pública Como Entidad De Gobierno\", adoptado según Resolución ANI No. 1638 del 31 de agosto de 2018. "]
[]
[]
[null,null,null,null,"2. REPORTE ACUMULADO",null,null,null,null,null,null,null,null,"Actualización:"]
[]
[]
[]
[]
[]
[]
[]
[]
[]
[]
[]
[]
[]
[]
[]
[]
[]
[]
[]
[]
[]
[]
{"$rows_left_out":40}